{"text_format":"1","workbook":"xlsx","n_sheets":5,"sheets":["別紙１（単体）","←単体で入札参加。どちらかに入力→","別紙１－②（代理人用) ","変更契約から紙契約希望→","別紙２（変更契約）"],"not_rendered":{"charts":0,"images":0,"macros":1,"external_links":0,"defined_names":4,"comments":3,"pivot_tables":0},"unopened":[],"bounds":{"document_bytes":16777216,"sheet_cells":100000,"rows_first":2000,"rows_last":500,"rows_between":2000,"halvings":0,"cell_chars":16384,"cell_head_chars":4096},"cells_cut":0,"cells_raw":0,"read":"whole","date_system":"1900"}

{"sheet":"別紙１（単体）","index":0,"n_rows":41,"n_cols":46,"rows_kept":41,"cut":false,"hidden":false,"merged":[[0,37,0,39],[1,37,1,39],[10,28,11,29],[10,30,11,34],[0,0,0,26],[1,29,2,30],[4,29,5,30],[30,0,34,1],[33,6,33,10],[31,2,33,4],[32,11,32,15],[32,17,32,25],[33,21,33,23],[33,16,33,19],[33,11,33,14],[32,6,32,10],[31,6,31,10],[8,9,8,14],[7,9,7,14],[6,9,6,14],[6,15,6,25],[7,15,7,25],[8,15,8,19],[8,21,8,25],[20,28,24,34],[20,9,21,25],[17,27,18,36],[7,29,8,30],[30,40,31,46],[25,40,26,45],[27,9,28,25],[22,9,23,25],[31,11,31,25],[25,9,26,25],[10,1,10,8],[20,6,23,6],[20,7,21,8],[22,7,23,8],[25,6,28,6],[25,7,26,8],[27,7,28,8],[17,1,18,3],[13,1,13,3],[14,1,14,3],[13,7,13,10],[14,7,14,25]]}
["契約に関する申出書",null,null,null,null,null,null,null,null,null,null,null,null,null,null,null,null,null,null,null,null,null,null,null,null,null,null,"はじめに選択↓",null,null,null,"契約区分",null,null,null,null,null,"入力箇所",null,null,null,null,null,null,"発注機関名","支出負担行為担当者名"]
[null,null,null,null,null,null,null,null,null,null,null,null,null,null,null,null,null,null,null,null,null,null,null,null,null,null,null,null,null,1,null,null,1,"工事",null,null,null,"選択箇所",null,null,null,null,null,10,"石狩振興局",{"$f":"AS2&\"長\"","v":"石狩振興局長"}]
[null,null,null,null,null,null,null,null,null,null,null,null,null,null,null,null,null,null,null,{"$f":"IF($AD$2=\"\",\"\",\"令和\")","v":"令和"},null,"年",null,"月",null,"日",null,null,null,null,null,null,2,"委託業務",null,null,null,null,null,null,null,null,null,11,"後志総合振興局",{"$f":"AS3&\"長\"","v":"後志総合振興局長"}]
[null,null,null,null,null,null,null,null,null,null,null,null,null,null,null,null,null,null,null,null,null,null,null,null,null,null,null,"次に選択↓",null,null,null,"発注機関",null,null,null,null,null,null,null,null,null,null,null,12,"檜山振興局","檜山振興局長"]
[null,{"$f":"IF(AD5=\"\",\"（支出負担行為担当者）\",VLOOKUP(AD5,$AR$2:$AT$15,3,1))&\"　様\"","v":"上川総合振興局長　様"},null,null,null,null,null,null,null,null,null,null,null,null,null,null,null,null,null,null,null,null,null,null,null,null,null,null,null,23,null,null,null,null,null,null,null,null,null,null,null,null,null,13,"渡島総合振興局","渡島総合振興局長"]
[null,null,null,null,null,null,null,null,null,null,null,null,null,null,null,null,null,null,null,null,null,null,null,null,null,null,null,null,null,null,null,null,null,null,null,null,null,null,null,null,null,null,null,14,"胆振総合振興局","胆振総合振興局長"]
[null,null,null,null,null,null,null,null,null,"住所",null,null,null,null,null,null,null,null,null,null,null,null,null,null,null,null,null,"次に選択↓",null,null,null,"契約形態",null,null,null,null,null,null,null,null,null,null,null,15,"日高振興局","日高振興局長"]
[null,null,null,null,null,null,null,null,null,"商号又は名称",null,null,null,null,null,null,null,null,null,null,null,null,null,null,null,null,null,null,null,1,null,null,1,"単体",null,null,null,null,null,null,null,null,null,16,"十勝総合振興局","十勝総合振興局長"]
[null,null,null,null,null,null,null,null,null,"代表者役職・氏名",null,null,null,null,null,null,null,null,null,null,null,null,null,null,null,null,null,null,null,null,null,null,null,null,null,null,null,null,null,null,null,null,null,17,"釧路総合振興局","釧路総合振興局長"]
[null,null,null,null,null,null,null,null,null,null,null,null,null,null,null,null,null,null,null,null,null,null,null,null,null,null,null,"最後に入力↓",null,null,null,null,null,null,null,null,null,null,null,null,null,null,null,18,"根室振興局","根室振興局長"]
[null,{"$f":"AE11","v":"00:00:00"},null,null,null,null,null,null,null,{"$f":"\"に開札予定の次の\"&IF(AD2=1,AH2,AH3)&\"について、落札者となった\"","v":"に開札予定の次の工事について、落札者となった"},null,null,null,null,null,null,null,null,null,null,null,null,null,null,null,null,null,null,"開札日",null,null,null,null,null,null,null,null,null,null,null,null,null,null,19,"オホーツク総合振興局","オホーツク総合振興局長"]
["場合の契約方法を、次のとおり申し出ます。",null,null,null,null,null,null,null,null,null,null,null,null,null,null,null,null,null,null,null,null,null,null,null,null,null,null,null,null,null,null,null,null,null,null,null,null,null,null,null,null,null,null,20,"宗谷総合振興局","宗谷総合振興局長"]
[null,null,null,null,null,null,null,null,null,null,null,null,null,null,null,null,null,null,null,null,null,null,null,null,null,null,null,null,null,null,null,null,null,null,null,null,null,null,null,null,null,null,null,21,"留萌振興局","留萌振興局長"]
["（",{"$f":"IF(AD2=1,\"工事番号\",\"業務番号\")","v":"工事番号"},null,null,"）",null,"（",null,null,null,null,"）",null,null,null,null,null,null,null,null,null,null,null,null,null,null,null,null,null,null,null,null,null,null,null,null,null,null,null,null,null,null,null,22,"空知総合振興局","空知総合振興局長"]
[null,{"$f":"IF(AD2=1,\"工事名\",\"業務名\")","v":"工事名"},null,null,null,null,null,null,null,null,null,null,null,null,null,null,null,null,null,null,null,null,null,null,null,null,null,"←案件名",null,null,null,null,null,null,null,null,null,null,null,null,null,null,null,23,"上川総合振興局","上川総合振興局長"]
[null,null,null,null,null,null,null,null,null,null,null,null,null,null,null,null,null,null,null,null,null,null,null,null,null,null,null,null,null,null,null,null,null,null,null,null,null,null,null,null,"＜ファイル名用＞"]
[null,null,null,null,null,null,null,null,null,null,null,null,null,null,null,null,null,null,null,null,null,null,null,null,null,null,null,null,null,null,null,null,null,null,null,null,null,null,null,null,null,null,null,"発注機関",{"$f":"VLOOKUP(AT17,AR2:AS15,2,1)","v":"上川総合振興局"},{"$f":"AD5","v":23}]
[null,"契約方法\n等の申出",null,null,null,null,null,"紙での契約を希望します。",null,null,null,null,null,null,null,null,null,null,null,null,null,null,null,null,null,null,null,"←どちらかにチェックしてください",null,null,null,null,null,null,null,null,null,null,null,null,null,null,null,"開札日",{"$f":"MONTH(AE11)&\"月\"&DAY(AE11)&\"日\"","v":"1月0日"}]
[null,null,null,null,null,null,null,"電子契約を希望します。",null,null,null,null,null,null,null,null,null,null,null,null,null,null,null,null,null,null,null,null,null,null,null,null,null,null,null,null,null,null,null,null,null,null,null,"整理番号",{"$f":"H14","v":0}]
[null,null,null,null,null,null,null,"なお、契約書送付先のメールアドレス等は、次のとおりです。",null,null,null,null,null,null,null,null,null,null,null,null,null,null,null,null,null,null,null,null,null,null,null,null,null,null,null,null,null,null,null,null,null,null,null,"入札参加者名",{"$f":"P8","v":0}]
[null,null,null,null,null,null,"締結\n権限者","氏名",null,null,null,null,null,null,null,null,null,null,null,null,null,null,null,null,null,null,null,null,"・発注者から契約担当→締結権限者の順に署名依頼のメールが届きます。\n・締結権限者のみの記載でも契約締結は可能です。",null,null,null,null,null,null,null,null,null,null,null,null,null,null,"タイトル","契約に関する申出書"]
[]
[null,null,null,null,null,null,null,"メール\nアドレス"]
[]
[null,null,null,null,null,null,null,null,null,null,null,null,null,null,null,null,null,null,null,null,null,null,null,null,null,null,null,null,null,null,null,null,null,null,null,null,null,null,null,null,"全ての入力内容を確認後、ＰＤＦに変換のうえ、"]
[null,null,null,null,null,null,"契約担当者","氏名",null,null,null,null,null,null,null,null,null,null,null,null,null,null,null,null,null,null,null,null,null,null,null,null,null,null,null,null,null,null,null,null,"電子入札システムにて、入札金額等の送信時に、"]
[]
[null,null,null,null,null,null,null,"メール\nアドレス",null,null,null,null,null,null,null,null,null,null,null,null,null,null,null,null,null,null,null,null,null,null,null,null,null,null,null,null,null,null,null,null,{"$f":"IF(AD2=1,\"工事\",\"委託\")&\"費内訳書とともに添付し、提出してください。\"","v":"工事費内訳書とともに添付し、提出してください。"}]
[null,null,null,null,null,null,null,null,null,null,null,null,null,null,null,null,null,null,null,null,null,null,null,null,null,null,null,null,null,null,null,null,null,null,null,null,null,null,null,null,"（１案件につき１枚、添付してください。）"]
[null,null,null,null,null,null,null,null,null,null,null,null,null,null,null,null,null,null,null,null,null,null,null,null,null,null,null,null,null,null,null,null,null,null,null,null,null,null,null,null,"なお、←のＰＤＦ化をクリックすると、"]
{"$rows_left_out":12}
{"sheet":"←単体で入札参加。どちらかに入力→","index":1,"n_rows":17,"n_cols":9,"rows_kept":17,"cut":false,"hidden":false,"merged":[[3,8,3,15]]}
[]
["別紙１（当初契約）　又は",null,null,null,null,null,null,null,"←ＩＣカードの名義が「代表者」の場合"]
[]
["別紙１（当初契約）（代理人ver）の",null,null,null,null,null,null,null,"←ＩＣカードの名義が代表者から委任された代理人の場合\n（年間委任状や当該案件に係る委任状の提出が必要）"]
[]
["どちらかに必要事項を入力後、",null,null,null,null,null,null,null,"※両方に入力すると別紙２に不具合が生じますので、どちらか一方にのみ入力してください"]
[]
["PDFで保存の上、入札金額送信の際、"]
[]
["内訳書と同時に提出してください"]
[]
[]
["＜電子入札案件に「紙参加」する場合＞"]
["　事前に必要事項を記入の上、開札日に持参し、落札者と"]
["なった場合に、契約担当課へ提出してください。"]
["　なお、郵送の場合は、入札書、内訳書とともに同封して"]
["ください。"]

{"sheet":"別紙１－②（代理人用) ","index":2,"n_rows":43,"n_cols":46,"rows_kept":43,"cut":false,"hidden":false,"merged":[[33,40,34,45],[22,28,26,34],[19,27,20,35],[28,40,29,45],[32,0,36,1],[33,2,35,4],[33,5,33,9],[33,11,33,25],[34,5,34,9],[34,11,34,15],[34,17,34,25],[35,5,35,9],[35,11,35,14],[35,16,35,19],[35,21,35,23],[26,40,27,45],[16,7,16,25],[19,1,20,3],[22,6,25,6],[22,7,23,8],[24,7,25,8],[27,6,30,6],[27,7,28,8],[9,15,9,25],[10,28,11,29],[10,30,11,34],[10,21,10,25],[12,1,12,7],[12,8,12,26],[15,7,15,10],[27,9,28,25],[29,7,30,8],[22,9,23,25],[24,9,25,25],[29,9,30,25],[15,1,15,3],[16,1,16,3],[6,8,6,14],[6,15,6,25],[7,29,8,30],[7,8,7,14],[7,15,7,25],[8,8,8,14],[8,15,8,19],[8,21,8,25],[0,0,0,26],[0,37,0,39],[1,29,2,30],[1,37,1,39],[4,29,5,30]]}
["契約に関する申出書",null,null,null,null,null,null,null,null,null,null,null,null,null,null,null,null,null,null,null,null,null,null,null,null,null,null,"はじめに選択↓",null,null,null,"契約区分",null,null,null,null,null,"入力箇所",null,null,null,null,null,null,"発注機関名","支出負担行為担当者名"]
[null,null,null,null,null,null,null,null,null,null,null,null,null,null,null,null,null,null,null,null,null,null,null,null,null,null,null,null,null,1,null,null,1,"工事",null,null,null,"選択箇所",null,null,null,null,null,10,"石狩振興局",{"$f":"AS2&\"長\"","v":"石狩振興局長"}]
[null,null,null,null,null,null,null,null,null,null,null,null,null,null,null,null,null,null,null,{"$f":"IF($AD$2=\"\",\"\",\"令和\")","v":"令和"},null,"年",null,"月",null,"日",null,null,null,null,null,null,2,"委託業務",null,null,null,null,null,null,null,null,null,11,"後志総合振興局",{"$f":"AS3&\"長\"","v":"後志総合振興局長"}]
[null,null,null,null,null,null,null,null,null,null,null,null,null,null,null,null,null,null,null,null,null,null,null,null,null,null,null,"次に選択↓",null,null,null,"発注機関",null,null,null,null,null,null,null,null,null,null,null,12,"檜山振興局","檜山振興局長"]
[null,{"$f":"IF(AD5=\"\",\"（支出負担行為担当者）\",VLOOKUP(AD5,$AR$2:$AT$15,3,1))&\"　様\"","v":"上川総合振興局長　様"},null,null,null,null,null,null,null,null,null,null,null,null,null,null,null,null,null,null,null,null,null,null,null,null,null,null,null,23,null,null,null,null,null,null,null,null,null,null,null,null,null,13,"渡島総合振興局","渡島総合振興局長"]
[null,null,null,null,null,null,null,null,null,null,null,null,null,null,null,null,null,null,null,null,null,null,null,null,null,null,null,null,null,null,null,null,null,null,null,null,null,null,null,null,null,null,null,14,"胆振総合振興局","胆振総合振興局長"]
[null,null,null,null,null,null,null,null,"住所",null,null,null,null,null,null,null,null,null,null,null,null,null,null,null,null,null,null,"次に選択↓",null,null,null,"契約形態",null,null,null,null,null,null,null,null,null,null,null,15,"日高振興局","日高振興局長"]
[null,null,null,null,null,null,null,null,"商号又は名称",null,null,null,null,null,null,null,null,null,null,null,null,null,null,null,null,null,null,null,null,1,null,null,1,"単体",null,null,null,null,null,null,null,null,null,16,"十勝総合振興局","十勝総合振興局長"]
[null,null,null,null,null,null,null,null,"代表者役職・氏名",null,null,null,null,null,null,null,null,null,null,null,null,null,null,null,null,null,null,null,null,null,null,null,null,null,null,null,null,null,null,null,null,null,null,17,"釧路総合振興局","釧路総合振興局長"]
[null,null,null,null,null,null,null,"代理人","住所",null,null,null,null,null,null,null,null,null,null,null,null,null,null,null,null,null,null,"最後に入力↓",null,null,null,null,null,null,null,null,null,null,null,null,null,null,null,18,"根室振興局","根室振興局長"]
[null,null,null,null,null,null,null,null,"氏名",null,null,null,null,null,null,null,null,null,null,null,null,null,null,null,null,null,null,null,"開札日",null,null,null,null,null,null,null,null,null,null,null,null,null,null,19,"オホーツク総合振興局","オホーツク総合振興局長"]
[null,null,null,null,null,null,null,null,null,null,null,null,null,null,null,null,null,null,null,null,null,null,null,null,null,null,null,null,null,null,null,null,null,null,null,null,null,null,null,null,null,null,null,20,"宗谷総合振興局","宗谷総合振興局長"]
[null,{"$f":"AE11","v":"00:00:00"},null,null,null,null,null,null,{"$f":"\"に開札予定の次の\"&IF(AD2=1,AH2,AH3)&\"について、落札者となった\"","v":"に開札予定の次の工事について、落札者となった"},null,null,null,null,null,null,null,null,null,null,null,null,null,null,null,null,null,null,null,null,null,null,null,null,null,null,null,null,null,null,null,null,null,null,21,"留萌振興局","留萌振興局長"]
["場合の契約方法を、次のとおり申し出ます。",null,null,null,null,null,null,null,null,null,null,null,null,null,null,null,null,null,null,null,null,null,null,null,null,null,null,null,null,null,null,null,null,null,null,null,null,null,null,null,null,null,null,22,"空知総合振興局","空知総合振興局長"]
[null,null,null,null,null,null,null,null,null,null,null,null,null,null,null,null,null,null,null,null,null,null,null,null,null,null,null,null,null,null,null,null,null,null,null,null,null,null,null,null,null,null,null,23,"上川総合振興局","上川総合振興局長"]
["（",{"$f":"IF(AD2=1,\"工事番号\",\"業務番号\")","v":"工事番号"},null,null,"）","（",null,null,null,null,null,"）",null,null,null,null,null,null,null,null,null,null,null,null,null,null,null,null,null,null,null,null,null,null,null,null,null,null,null,null,"＜ファイル名用＞"]
[null,{"$f":"IF(AD2=1,\"工事名\",\"業務名\")","v":"工事名"},null,null,null,null,null,null,null,null,null,null,null,null,null,null,null,null,null,null,null,null,null,null,null,null,null,"←案件名",null,null,null,null,null,null,null,null,null,null,null,null,null,null,null,"発注機関",{"$f":"VLOOKUP(AT17,AR2:AS15,2,1)","v":"上川総合振興局"},{"$f":"AD5","v":23}]
[null,null,null,null,null,null,null,null,null,null,null,null,null,null,null,null,null,null,null,null,null,null,null,null,null,null,null,null,null,null,null,null,null,null,null,null,null,null,null,null,null,null,null,"開札日",{"$f":"MONTH(AE11)&\"月\"&DAY(AE11)&\"日\"","v":"1月0日"}]
[null,null,null,null,null,null,null,null,null,null,null,null,null,null,null,null,null,null,null,null,null,null,null,null,null,null,null,null,null,null,null,null,null,null,null,null,null,null,null,null,null,null,null,"整理番号",{"$f":"H16","v":0}]
[null,"契約方法\n等の申出",null,null,null,null,null,"紙での契約を希望します。",null,null,null,null,null,null,null,null,null,null,null,null,null,null,null,null,null,null,null,"←どちらかにチェックしてください",null,null,null,null,null,null,null,null,null,null,null,null,null,null,null,"入札参加者名",{"$f":"P8","v":0}]
[null,null,null,null,null,null,null,"電子契約を希望します。",null,null,null,null,null,null,null,null,null,null,null,null,null,null,null,null,null,null,null,null,null,null,null,null,null,null,null,null,null,null,null,null,null,null,null,"タイトル","契約に関する申出書"]
[null,null,null,null,null,null,null,"なお、契約書送付先のメールアドレス等は、次のとおりです。"]
[null,null,null,null,null,null,"締結\n権限者","氏名",null,null,null,null,null,null,null,null,null,null,null,null,null,null,null,null,null,null,null,null,"・発注者から契約担当→締結権限者の順に署名依頼のメールが届きます。\n・締結権限者のみの記載でも契約締結は可能です。"]
[]
[null,null,null,null,null,null,null,"メール\nアドレス"]
[]
[null,null,null,null,null,null,null,null,null,null,null,null,null,null,null,null,null,null,null,null,null,null,null,null,null,null,null,null,null,null,null,null,null,null,null,null,null,null,null,null,"全ての入力内容を確認後、ＰＤＦに変換のうえ、"]
[null,null,null,null,null,null,"契約担当者","氏名"]
[null,null,null,null,null,null,null,null,null,null,null,null,null,null,null,null,null,null,null,null,null,null,null,null,null,null,null,null,null,null,null,null,null,null,null,null,null,null,null,null,"電子入札システムにて、入札金額等の送信時に、"]
[null,null,null,null,null,null,null,"メール\nアドレス"]
{"$rows_left_out":14}
{"sheet":"変更契約から紙契約希望→","index":3,"n_rows":14,"n_cols":1,"rows_kept":14,"cut":false,"hidden":false,"merged":[]}
[]
["変更契約から「紙契約」を希望する"]
[]
["場合、別紙２（変更契約）を、直接"]
[]
["契約担当課へ提出してください。"]
[]
["なお、メールで提出される場合は、"]
[]
["行き違い等の防止のため、お手数"]
[]
["ですが、その旨、電話連絡をお願い"]
[]
["いたします。"]

{"sheet":"別紙２（変更契約）","index":4,"n_rows":29,"n_cols":56,"rows_kept":29,"cut":false,"hidden":false,"merged":[[28,8,28,23],[19,14,19,17],[19,19,19,21],[16,0,20,1],[17,2,19,4],[17,5,17,8],[17,9,17,23],[18,5,18,8],[18,9,18,13],[18,15,18,23],[19,5,19,8],[19,9,19,12],[26,7,26,23],[27,7,27,23],[10,26,11,27],[10,28,11,32],[10,1,10,6],[10,7,10,24],[13,1,13,3],[13,6,13,8],[15,38,16,44],[20,38,21,47],[0,0,0,24],[8,7,8,12],[8,13,8,17],[8,19,8,23],[0,35,0,37],[1,27,2,28],[1,35,1,37],[4,27,5,28],[6,7,6,12],[6,13,6,23],[7,7,7,12],[7,13,7,23],[14,1,14,3],[14,6,14,23]]}
["変更契約に関する申出書",null,null,null,null,null,null,null,null,null,null,null,null,null,null,null,null,null,null,null,null,null,null,null,null,null,null,null,null,"契約区分",null,null,null,null,null,"入力箇所",null,null,null,null,null,null,null,null,null,null,null,null,null,null,null,null,null,null,"発注機関名","支出負担行為担当者名"]
[null,null,null,null,null,null,null,null,null,null,null,null,null,null,null,null,null,null,null,null,null,null,null,null,null,null,null,1,null,null,1,"工事",null,null,null,"選択箇所",null,null,null,null,null,null,null,null,null,null,null,null,null,null,null,null,null,10,"石狩振興局",{"$f":"BC2&\"長\"","v":"石狩振興局長"}]
[null,null,null,null,null,null,null,null,null,null,null,null,null,null,null,null,null,{"$f":"IF($AB$2=\"\",\"\",\"令和\")","v":"令和"},null,"年",null,"月",null,"日",null,null,null,null,null,null,2,"委託業務",null,null,null,null,null,null,null,null,null,null,null,null,null,null,null,null,null,null,null,null,null,11,"後志総合振興局",{"$f":"BC3&\"長\"","v":"後志総合振興局長"}]
[null,null,null,null,null,null,null,null,null,null,null,null,null,null,null,null,null,null,null,null,null,null,null,null,null,null,null,null,null,"発注機関",null,null,null,null,null,null,null,null,null,null,null,null,null,null,null,null,null,null,null,null,null,null,null,12,"檜山振興局","檜山振興局長"]
[null,{"$f":"IF(AB5=\"\",\"（支出負担行為担当者）\",VLOOKUP(AB5,$BB$2:$BD$15,3,1))&\"　様\"","v":"宗谷総合振興局長　様"},null,null,null,null,null,null,null,null,null,null,null,null,null,null,null,null,null,null,null,null,null,null,null,null,null,20,null,null,null,null,null,null,null,null,null,null,null,null,null,null,null,null,null,null,null,null,null,null,null,null,null,13,"渡島総合振興局","渡島総合振興局長"]
[null,null,null,null,null,null,null,null,null,null,null,null,null,null,null,null,null,null,null,null,null,null,null,null,null,null,null,null,null,null,null,null,null,null,null,null,null,null,null,"＜ファイル名用＞",null,null,null,null,null,null,null,null,null,null,null,null,null,14,"胆振総合振興局","胆振総合振興局長"]
[null,null,null,null,null,null,null,"住所",null,null,null,null,null,{"$f":"IF('別紙１－②（代理人用) '!P7=\"\",'別紙１（単体）'!P7,'別紙１－②（代理人用) '!P7)","v":0},null,null,null,null,null,null,null,null,null,null,null,null,null,null,null,null,null,null,null,null,null,null,null,null,null,null,null,"発注機関",{"$f":"VLOOKUP(AR7,BB2:BC15,2,1)","v":"宗谷総合振興局"},{"$f":"AB5","v":20},null,null,null,null,null,null,null,null,null,15,"日高振興局","日高振興局長"]
[null,null,null,null,null,null,null,"商号又は名称",null,null,null,null,null,{"$f":"IF('別紙１－②（代理人用) '!P8=\"\",'別紙１（単体）'!P8,'別紙１－②（代理人用) '!P8)","v":0},null,null,null,null,null,null,null,null,null,null,null,null,null,null,null,null,null,null,null,null,null,null,null,null,null,null,null,"当初契約日",{"$f":"MONTH(AC1)&\"月\"&DAY(AC1)&\"日\"","v":"1月0日"},null,null,null,null,null,null,null,null,null,null,16,"十勝総合振興局","十勝総合振興局長"]
[null,null,null,null,null,null,null,"代表者役職・氏名",null,null,null,null,null,{"$f":"IF('別紙１－②（代理人用) '!P9=\"\",'別紙１（単体）'!P9,'別紙１－②（代理人用) '!P9)","v":0},null,null,null,null,null,{"$f":"IF('別紙１－②（代理人用) '!V9=\"\",'別紙１（単体）'!V9,'別紙１－②（代理人用) '!V9)","v":0},null,null,null,null,null,null,null,null,null,null,null,null,null,null,null,null,null,null,null,null,null,{"$f":"B14","v":"工事番号"},{"$f":"G14","v":0},null,null,null,null,null,null,null,null,null,null,17,"釧路総合振興局","釧路総合振興局長"]
[null,null,null,null,null,null,null,null,null,null,null,null,null,null,null,null,null,null,null,null,null,null,null,null,null,"はじめに入力↓",null,null,null,null,null,null,null,null,null,null,null,null,null,null,null,{"$f":"IF(AB2=1,\"受注者\",\"受託者\")","v":"受注者"},{"$f":"N8","v":0},null,null,null,null,null,null,null,null,null,null,18,"根室振興局","根室振興局長"]
[null,{"$f":"AC11","v":"00:00:00"},null,null,null,null,null,{"$f":"\"に契約締結した次の\"&IF(AB2=1,AF2,AF3)&\"について、\"&\"第\"&AE14&\"回変更契約から\"","v":"に契約締結した次の工事について、第１回変更契約から"},null,null,null,null,null,null,null,null,null,null,null,null,null,null,null,null,null,null,"当初\n契約日",null,null,null,null,null,null,null,null,null,null,null,null,null,null,"タイトル","契約に関する申出書",null,null,null,null,null,null,null,null,null,null,19,"オホーツク総合振興局","オホーツク総合振興局長"]
["紙での契約を希望するので、申し出ます。",null,null,null,null,null,null,null,null,null,null,null,null,null,null,null,null,null,null,null,null,null,null,null,null,null,null,null,null,null,null,null,null,null,null,null,null,null,null,null,null,null,null,null,null,null,null,null,null,null,null,null,null,20,"宗谷総合振興局","宗谷総合振興局長"]
[null,null,null,null,null,null,null,null,null,null,null,null,null,null,null,null,null,null,null,null,null,null,null,null,null,null,null,null,null,null,null,null,null,null,null,null,null,null,null,null,null,null,null,null,null,null,null,null,null,null,null,null,null,21,"留萌振興局","留萌振興局長"]
["（",{"$f":"IF(AB2=1,\"工事番号\",\"業務番号\")","v":"工事番号"},null,null,"）","（",{"$f":"IF('別紙１－②（代理人用) '!H16=\"\",'別紙１（単体）'!H14,'別紙１－②（代理人用) '!H16)","v":0},null,null,"）",null,null,null,null,null,null,null,null,null,null,null,null,null,null,null,null,"設計変更回数",null,null,null,"１","←最後に入力",null,null,null,null,null,null,null,null,null,null,null,null,null,null,null,null,null,null,null,null,null,22,"空知総合振興局","空知総合振興局長"]
[null,{"$f":"IF(AB2=1,\"工事名\",\"業務名\")","v":"工事名"},null,null,null,null,{"$f":"IF('別紙１－②（代理人用) '!H17=\"\",'別紙１（単体）'!H15,'別紙１－②（代理人用) '!H17)","v":0},null,null,null,null,null,null,null,null,null,null,null,null,null,null,null,null,null,null,null,null,null,null,null,null,null,null,null,null,null,null,null,null,null,null,null,null,null,null,null,null,null,null,null,null,null,null,23,"上川総合振興局","上川総合振興局長"]
[null,null,null,null,null,null,null,null,null,null,null,null,null,null,null,null,null,null,null,null,null,null,null,null,null,null,null,null,null,null,null,null,null,null,null,null,null,null,"全ての入力内容を確認後、ＰＤＦに変換のうえ、"]
["連絡先"]
[null,null,"担当者",null,null,"（所属）",null,null,null,null,null,null,null,null,null,null,null,null,null,null,null,null,null,null,null,null,null,null,null,null,null,null,null,null,null,null,null,null,"入札契約課へ送付してください。"]
[null,null,null,null,null,"（職・氏名）",null,null,null,null,null,null,null,null,"・",null,null,null,null,null,null,null,null,null,null,"当初契約時と連絡先が違う場合も想定されるので",null,null,null,null,null,null,null,null,null,null,null,null,"なお、←のＰＤＦ化をクリックすると、"]
[null,null,null,null,null,"（電話番号）",null,null,null,null,null,null,null,"－",null,null,null,null,"－",null,null,null,null,null,null,"お手数ですが、ご入力ください",null,null,null,null,null,null,null,null,null,null,null,null,"このエクセルシートが保存されている場所と同じ場所に"]
[null,null,null,null,null,null,null,null,null,null,null,null,null,null,null,null,null,null,null,null,null,null,null,null,null,null,null,null,null,null,null,null,null,null,null,null,null,null,{"$f":"\"「発注機関名_当初契約日_\"&B14&\"_契約者名_変更契約に係る申出書」\"","v":"「発注機関名_当初契約日_工事番号_契約者名_変更契約に係る申出書」"}]
[]
[null,"（留意事項）",null,null,null,null,null,null,null,null,null,null,null,null,null,null,null,null,null,null,null,null,null,null,null,null,null,null,null,null,null,null,null,null,null,null,null,null,"をファイル名としたこの様式が、ＰＤＦで保存されます。"]
[null,null,"※",{"$f":"\"この申出書は、\"&IF(AB2=1,\"工事監督員\",\"業務担当員\")&\"に変更契約に係る設計変更上申日を確認した上で、\"","v":"この申出書は、工事監督員に変更契約に係る設計変更上申日を確認した上で、"},null,null,null,null,null,null,null,null,null,null,null,null,null,null,null,null,null,null,null,null,null,null,null,null,null,null,null,null,null,null,null,null,null,null,"（ＰＤＦの保存範囲は、Ａ～Ｙ列までです。）"]
[null,null,null,"各発注機関へ直接、提出してください。"]
[]
[null,null,null,"提 出 先",null,null,null,{"$f":"VLOOKUP(AB5,'別紙１（単体）'!$AR$2:$AV$12,2,1)&VLOOKUP(AB5,'別紙１（単体）'!$AR$2:$AW$12,6,1)","v":"宗谷総合振興局"}]
[null,null,null,"電　　話",null,null,null,{"$f":"VLOOKUP(AB5,'別紙１（単体）'!$AR$2:$AV$12,5,1)","v":0}]
[null,null,null,"メールアドレス",null,null,null,null,{"$f":"VLOOKUP(AB5,'別紙１（単体）'!$AR$2:$AV$12,4,1)","v":0}]